{"text_format":"1","workbook":"xlsx","n_sheets":11,"sheets":["DATA","LIST","IO 1","IO 2","Безопасность","Конструкция Буера","Правила","Право дороги","Управление","Навигация","Практика"],"not_rendered":{"charts":0,"images":16,"macros":1,"external_links":0,"defined_names":1,"comments":1,"pivot_tables":0},"unopened":[],"bounds":{"document_bytes":16777216,"sheet_cells":100000,"rows_first":2000,"rows_last":500,"rows_between":2000,"halvings":0,"cell_chars":16384,"cell_head_chars":4096},"cells_cut":0,"cells_raw":0,"read":"whole","date_system":"1900"}

{"sheet":"DATA","index":0,"n_rows":13453,"n_cols":19,"rows_kept":13453,"cut":false,"hidden":false,"merged":[]}
[]
[]
[]
[]
[]
[]
[]
[null,"Печатать один билет",14114,"ввести номер из колонки A"]
[]
[]
{"$rows_left_out":13444}
{"sheet":"LIST","index":1,"n_rows":36,"n_cols":9,"rows_kept":36,"cut":false,"hidden":false,"merged":[[0,7,0,8],[29,0,29,1],[31,5,31,8]]}
[null,{"$f":"\" ЭКЗАМЕНАЦИОННЫЙ ЛИСТ №  \"&VLOOKUP($A$7,DATA!$A$14:$S$100444,1,TRUE)&\"/\"&VLOOKUP($A$7,DATA!$A$14:$S$100444,3,TRUE)","v":" ЭКЗАМЕНАЦИОННЫЙ ЛИСТ №  14852/Тетушкин "},null,"                                           ЭКЗАМЕНАЦИОННАЯ ВЕДОМОСТЬ",null,null,null,{"$f":"VLOOKUP($A$7,DATA!$A$14:$X$99920,10,TRUE)","v":"Россия / RUS"}]
[null,"     ",null,"                          Результаты квалификационных испытаний "]
[null,{"$f":"\" Имя    \"&VLOOKUP($A$7,DATA!$A$14:$X$99920,4,TRUE)","v":" Имя    Роман"},null,"                                     по теоретической подготовке ",null,null,"Билет №",{"$f":"RIGHT(A7)","v":"6"}]
["Место",null,null,null,"Наименование дисциплины ","часов","Оценка ","Дата ","фамилия "]
["для ",{"$f":"\" Имя    \"&VLOOKUP($A$7,DATA!$A$14:$X$99920,5,TRUE)","v":" Имя    Тимофеевич"},null,"№ ",null,null,null,null,"экзаменатора"]
["фото","    ",null,"  1.","Теория и устройство парусной яхты.",8,"хор",{"$f":"TODAY()","v":"2025-03-11"}]
[15066,{"$f":"\" Name    \"&VLOOKUP($A$7,DATA!$A$14:$X$99920,6,TRUE)","v":" Name    Tetushkin Roman"},null,"  2.","Судовождение.",2,"отл",{"$f":"TODAY()","v":"2025-03-11"}]
[null,"                                 Фамилия, имя  на английском языке",null,null," Лоция и Навигация.",4,"отл","2025-03-11"]
[null,null,null,"  3.","Управление парусной яхтой",8,"хор","2025-03-11"]
[{"$f":"\"Год, дата рождения и место рождения   \"&VLOOKUP($A$7,DATA!$A$14:$X$99920,7,TRUE)&VLOOKUP($A$7,DATA!$A$14:$X$99920,8,TRUE)","v":"Год, дата рождения и место рождения   41155MOSCOW"},null,null,"  4.","Эксплуатация яхты.",2,"отл","2025-03-11"]
{"$rows_left_out":27}
{"sheet":"IO 1","index":2,"n_rows":15,"n_cols":3,"rows_kept":15,"cut":false,"hidden":false,"merged":[[1,1,1,2],[13,1,13,2],[14,1,14,2],[11,2,12,2]]}
["Экзаменационные вопросы  - РУЛЕВОЙ  ПАРУСНОЙ ЯХТЫ 6 кв.м",null,{"$f":"LIST!H1","v":"Россия / RUS"}]
[null,"КВАЛИФИКАЦИОННЫЕ ТРЕБОВАНИЯ ПОДГОТОВКИ РУЛЕВЫХ И КАПИТАНОВ ПАРУСНЫХ ЯХТ"]
[null,"Экзаменатор  - Маслов А.О.",{"$f":"\"Испытуемый  \"&LIST!B3","v":"Испытуемый   Имя    Роман"}]
[null,"Билет  БУЕР INTERNATIONAL OPTIMIST",{"$f":"LIST!H3","v":"6"}]
[null,"Дисциплина     Личная Безопасность"]
[null,{"$f":"\"ответить на вопрос           \"     &  CHAR(10) &  CHAR(10) &          VLOOKUP(IF(($C$4+RANDBETWEEN(1,20))<20,RANDBETWEEN(1,20),RANDBETWEEN(1,20)),Безопасность!A1:C20,2,FALSE)","v":"ответить на вопрос           \n\n"},{"$f":"\"           БЕЗОПАСНОСТЬ       \"     &  CHAR(10) &  \"ответить на вопрос  \"&CHAR(10) &          VLOOKUP(IF(($C$4+RANDBETWEEN(1,20))<20,RANDBETWEEN(1,20),RANDBETWEEN(1,20)),Безопасность!G1:H20,2,FALSE)","v":"           БЕЗОПАСНОСТЬ       \nответить на вопрос  \nОпрокидывание буера; действия рулевого."}]
[null,{"$f":"\"            ответить на вопрос           \"     &  CHAR(10) &           VLOOKUP(IF(($C$4+RANDBETWEEN(1,20))<20,RANDBETWEEN(1,20),RANDBETWEEN(1,20)),Навигация!A1:C20,2,FALSE)","v":"            ответить на вопрос           \nКурсы буера относительно ветра: “на ветер”, “по ветру”, левентик. "},"Перечислить опасные места на льду:\n-\n-\n-\nВопрос - Как выбраться из полыньи?"]
[1,"ОБЩИЕ СВЕДЕНИЯ ОБ УСТРОЙСТВЕ БУЕРА"]
[null,"Подписать части буера"]
[]
{"$rows_left_out":6}
{"sheet":"IO 2","index":3,"n_rows":15,"n_cols":3,"rows_kept":15,"cut":false,"hidden":false,"merged":[[1,1,1,2],[14,1,14,2],[13,1,13,2],[11,2,12,2]]}
["Экзаменационные вопросы  - РУЛЕВОЙ  ПАРУСНОЙ ЯХТЫ 6 кв.м",null,{"$f":"LIST!H1","v":"Россия / RUS"}]
[null,"КВАЛИФИКАЦИОННЫЕ ТРЕБОВАНИЯ ПОДГОТОВКИ РУЛЕВЫХ И КАПИТАНОВ ПАРУСНЫХ ЯХТ"]
[null,"Экзаменатор  - Маслов А.О.",{"$f":"\"Испытуемый  \"&LIST!B3","v":"Испытуемый   Имя    Роман"}]
[null,"Билет  БУЕР INTERNATIONAL OPTIMIST",{"$f":"LIST!H3","v":"6"}]
[null,"Дисциплина     Личная Безопасность"]
[null,{"$f":"\"ответить на вопрос           \"     &  CHAR(10) &  CHAR(10) &          VLOOKUP(IF(($C$4+RANDBETWEEN(1,20))<20,RANDBETWEEN(1,20),RANDBETWEEN(1,20)),Безопасность!A1:C20,2,FALSE)","v":"ответить на вопрос           \n\nКак подавать сигналы бедствия"},{"$f":"\"            Правила безопасности в гонках Гоноках  на буерах       \"     &  CHAR(10) &  \"ответить на вопрос  \"&CHAR(10) &          VLOOKUP(IF(($C$4+RANDBETWEEN(1,20))<20,RANDBETWEEN(1,20),RANDBETWEEN(1,20)),Безопасность!G1:H20,2,FALSE)","v":"            Правила безопасности в гонках Гоноках  на буерах       \nответить на вопрос  \nСПЕЦИАЛЬНЫЕ ПРАВИЛА ДЛЯ  ГОНОК\n Переносное оборудование должно быть в наличии на Буере в гонке:\n-1\n- 2\n- 3"}]
[null,{"$f":"\"            ответить на вопрос           \"     &  CHAR(10) &           VLOOKUP(IF(($C$4+RANDBETWEEN(1,20))<20,RANDBETWEEN(1,20),RANDBETWEEN(1,20)),Навигация!A1:C20,2,FALSE)","v":"            ответить на вопрос           \nПроверка Буера перед выходом на соответствие правилам класса"},"Расказать про правила безопасности на льду?"]
[1,"ОБЩИЕ СВЕДЕНИЯ ОБ УСТРОЙСТВЕ БУЕРА"]
[null,"Подписать части буера"]
[]
{"$rows_left_out":6}
{"sheet":"Безопасность","index":4,"n_rows":24,"n_cols":8,"rows_kept":24,"cut":false,"hidden":false,"merged":[]}
[1,"Какие действия следует предпринять, если видишь сигнал бедствия.",null,null,1,"Если два Буера идут курсами, пересекающимися таким образом, что может возникнуть опасность столкновения, то: \n- 1.\n- 2.\n- 3.",1,"Подход буера к препятствию. "]
[2,"Что ты можешь сделать увидев сигнал бедствия?",null,null,2,"Буера должны пересекать судовой ход под углом -…......?",2,"Опрокидывание буера; действия рулевого."]
[3,"Что ты сделаешь если объявлена спасательная операция.",null,null,3,"Буера  должны выполнять оборот, связанный с пересечением судового хода, таким образом, чтобы ",3," Буер попал в полынью одним коньком или провалился полностью; действия рулевого. "]
[4,"Какие виды помощи на льду существуют",null,null,4,"Буера должны пересекать судовой ход под углом -…......?",4,"Поломка на ходу румпеля, балки мачты, рулевой тяги, конёк попал в трещину (согнулся или сломался пополам); действия рулевого."]
[5,"Правила поведения на льду",null,null,5,"Буера  должны выполнять оборот, связанный с пересечением судового хода, таким образом, чтобы ",5,"Подход буера к препятствию. "]
[6,"Индивидуальные сигнальные устройства",null,null,6,"Аварии буера  и их ликвидация. ",6,"Опрокидывание буера; действия рулевого."]
[7,"Предотвращение выпадения человек из буера",null,null,7,"Опрокидывание буера во время гонок на чистом льду, действия водителя. ",7," Буер попал в полынью одним коньком или провалился полностью; действия рулевого. "]
[8,"Какие могут возникнуть сложности при спасении «человека  провалившегося под лед\"???",null,null,8,"Буер провалился под лёд на осеннем льду; на весеннем льду. ",8,"Поломка на ходу румпеля, балки мачты, рулевой тяги, конёк попал в трещину (согнулся или сломался пополам); действия рулевого."]
[9,"Что ты будешь делать если ты оказался в воде.",null,null,9,"В чём различия методов ликвидации аварии, техника безопасности. ",9,"Поломка на ходу румпеля, балки мачты, рулевой тяги, конёк попал в трещину (согнулся или сломался пополам); действия рулевого."]
[10,"Как подойти к человеку оказавшемуся  в воде на льду???",null,null,10,"При движении буера лёд потрескивает, действия водителя буера.",10,"СПЕЦИАЛЬНЫЕ ПРАВИЛА ДЛЯ  ГОНОК\n Переносное оборудование должно быть в наличии на Буере в гонке:\n-1\n- 2\n- 3"]
{"$rows_left_out":15}
{"sheet":"Конструкция Буера","index":5,"n_rows":45,"n_cols":3,"rows_kept":45,"cut":false,"hidden":false,"merged":[]}
[1,"Основные части корпуса буера ?????","Носовая и кормовая часть, правы и левый борт, днище."]
[2,"Основные детали корпуса буера????","Бортовая дощечка правая и левая, передняя, задняя бобышка, поперечный набор, подмачтовая коробка, обшивка корпуса, буртики, кницы, упоры балки."]
[3,"Рулевое управление буера ????","Поворотная муфта переднего конька, тяга, задняя вилка румпеля, румпель."]
[4,"Подмачтовая шаровая опора ???","Постоянная, на ползуне."]
[5,"Рейка крепления гика-шкотов на палубе, передняя оковка, ватер-краспица.","Рейка крепления гика-шкотов на палубе, передняя оковка, ватер-краспица."]
[6,"Рангоут, состав и разрешенные материалы для изготовления","Мачта, гик."]
[7,"Балка ???","Крепление муфт, их параллельность, крепление балки к корпусу."]
[8,"Такелаж стоячий ???","Ванты, штаг, ватер-штаг. "]
[9,"Такелаж бегучий: фалы, шкоты.","Фалы, шкоты."]
[10,"Дельные вещи Буера???","Блоки, талрепы, стопора, болты крепления балки, коньков, мочки."]
{"$rows_left_out":36}
{"sheet":"Правила","index":6,"n_rows":40,"n_cols":9,"rows_kept":40,"cut":false,"hidden":false,"merged":[]}
[1,"Прекращать. ","Прекращать. Гонка, которую прекращает гоночный или протестовый комитет, считается недействительной, но она может быть повторена.",1,"Буер В обязан уступить дорогу ?  на одном галсе , чисто впереди-чисто позади",null,null,null,"на одном галсе , чисто впереди-чисто позади"]
[2,"Чисто позади и чисто впереди; связаны.","Чисто позади и чисто впереди; связаны. Яхта находится чисто позади другой яхты, когда её корпус и оборудование в нормальном положении находятся позади траверза самой задней точки корпуса или оборудования другой яхты (в нормальном положении). Другая яхта находится чисто впереди. Яхты связаны, если ни одна из них не находится чисто позади другой. Они, однако, так же связаны, если яхта, находящаяся между ними, связана с обеими. Эти термины всегда применимы к яхтам, находящимся на одном галсе. Они не применяются к яхтам, находящимся на противоположных галсах, за исключением случаев, когда применяется правило 18  или когда обе яхты идут под углом более 90° к направлению истинного ветра.",2,"Буер В обязан уступить дорогу ?  на одном галсе , чисто впереди-чисто позади"]
[3,"Выходить на знак. ","Выходить на знак. Яхта выходит на знак, если она находится в такой позиции, что может, не изменяя галса, пройти знак с наветренной стороны и оставить его с предписанной стороны.",3,"Буерная Дистанция и ее виды "]
[4,"Финиш. ","Финиш. Яхта финиширует, когда любая часть её корпуса, экипажа или оборудования в их нормальном положении  пересекает финишную линию в направлении от последнего знака или впервые, или после выполнения наказания согласно правилу 44.2, либо после исправления по правилу 28.1 ошибки, сделанной у финишной линии.",4,"Буерная Дистанция и ее виды "]
[5,"Заинтересованная сторона. ","Заинтересованная сторона. Любое лицо, которое может выиграть либо потерять вследствие решения протестового комитета или явно лично заинтересованное в таком решении.",5,"В каких случаях старт гонка может быть прекращена?"]
[6,"Сторониться. ","Сторониться. Яхта сторонится  другой яхты, если та может идти своим курсом без необходимости предпринимать избегающие действия, и когда яхты связаны на одном галсе, если подветренная яхта может изменить курс в любом направлении без немедленного касания наветренной яхты.",6,"В каких случаях старт может быть отложен?"]
[7,"Подветренная и наветренная. ","Подветренная и наветренная. Подветренная сторона яхты - это сторона, противоположная той, на которую дует ветер, или которая была противоположной до того, как яхта оказалась в положении носом против ветра. Однако, если яхта идет по ветру, и ветер дует со стороны, на которой она несёт свой грот, или чисто в корму, то подветренной стороной считается сторона, на которой находится грот. Другая сторона яхты - наветренная. Когда две яхты находятся на одном и том же галсе и связаны, то подветренной считают ту яхту, которая находится на подветренной стороне другой яхты. Другая яхта является наветренной.",7,"Дать опредление термину \"Гонка\" "]
[8,"Знак. ","Знак. Объект, который гоночная инструкция требует оставлять с предписанной стороны от яхты, и судно гоночного комитета, окруженное свободной водой и от которого проходит стартовая или финишная линия. Якорный канат и любые предметы, случайно или временно присоединенные к знаку, не считаются его частью.",8,"Является ли перевернувшийся  Буер препятствием?"]
[9,"Место у знака. ","Место у знака. Место, нужное яхте, чтобы идти к знаку, и затем место, нужное ей, чтобы идти надлежащим курсом у знака. Однако место у знака не включает место для поворота оверштаг; исключением является ситуация, когда яхта внутренняя и связана с наветренной стороны с яхтой, обязанной предоставить место у знака.   ",9,"Дать опредление термину \"Гонка\" "]
[10,"Препятствие. ","Препятствие. Объект, который яхта, находясь от него на расстоянии длины своего корпуса и идя прямо на него, не могла бы обойти без существенного изменения курса. Препятствием является также, который можно безопасно пройти только с одной стороны. Гоночная инструкция может предписать, что определенные зоны акватории должны рассматриваться как препятствия. Однако яхта, находящаяся в гонке, не является препятствием для других яхт, если они не должны сторониться её или предоставлять место или место у знака, или избегать ее, согласно правилу 22. Судно на ходу, включая яхту, находящуюся в гонке, никогда не является препятствием большой протяжённости.",10,"Какаой из Буеров имеет право дороги ?    правый-левый галс -галфвинд"]
{"$rows_left_out":31}
{"sheet":"Право дороги","index":7,"n_rows":40,"n_cols":3,"rows_kept":40,"cut":false,"hidden":false,"merged":[]}
[1,"Правило 1. Буер, находящийся в движении, должен ________________________________________________________","Буер, находящийся в движении, должен сторониться буера, не имеющего хода."]
[2,"Правило 2. Буер, спускающийся от НАВЕТРЕННОГО (верхнего) ЗНАКА по ветру, должен________________________________","Буер, спускающийся от НАВЕТРЕННОГО (верхнего) ЗНАКА по ветру, должен уступать дорогу буерам, идущим от ПОДВЕТРЕННОГО (нижнего) ЗНАКА против ветра."]
[3,"Правило 3 А. Когда буера идут разными ГАЛСАМИ на ПОЛНОМ КУРСЕ (по ветру) , ТО буер, идущий ЛЕВЫМ ГАЛСОМ, должен _________________________________________________","Когда буера идут разными ГАЛСАМИ на ПОЛНОМ КУРСЕ (по ветру) или на ОСТРОМ КУРСЕ (против ветра), то буер, идущий ЛЕВЫМ ГАЛСОМ, должен уступать дорогу буеру, идущему ПРАВЫМ ГАЛСОМ."]
[4,"Правило 3 В. Когда буера идут разными ГАЛСАМИ на ОСТРОМ КУРСЕ (против ветра), ТО буер, идущий ЛЕВЫМ ГАЛСОМ, должен_______________ __________________________________________________________","Когда буера идут разными ГАЛСАМИ на ПОЛНОМ КУРСЕ (по ветру) или на ОСТРОМ КУРСЕ (против ветра), то буер, идущий ЛЕВЫМ ГАЛСОМ, должен уступать дорогу буеру, идущему ПРАВЫМ ГАЛСОМ."]
[5,"Правило 4 А. Когда буера идут одинаковыми (правым) галсами ОСТРЫМ КУРСОМ (против ветра), ТО НАВЕТРЕННЫЙ буер должен ______________________ ___________________________________________________","Когда буера идут одинаковыми галсами ОСТРЫМ КУРСОМ (против ветра), НАВЕТРЕННЫЙ буер должен уступить дорогу."]
[6,"Правило 4 В. Когда буера идут одинаковыми (левым) галсами ОСТРЫМ КУРСОМ (против ветра), ТО НАВЕТРЕННЫЙ буер должен _____________________ ___________________________________________________","Когда буера идут одинаковыми галсами ОСТРЫМ КУРСОМ (против ветра), НАВЕТРЕННЫЙ буер должен уступить дорогу."]
[7,"Правило 5 А. Буер, имеющий право дороги, не должен _________________________________","Буер, имеющий право дороги, не должен изменить свой курс таким образом, чтобы этим вводить в заблуждение или помешать не имеющему право дорога буеру. "]
[8,"Правило 5 B  Когда буера, идут одним галсом, обгоняющий буер не должен ___________________","Когда буера, идут одним галсом, обгоняющий буер не должен мешать обгоняемому."]
[9,"Правило 6 А. Буер не должен делать поворот фордевинд , если это может __________________________________________","Буер не должен делать поворот фордевинд или оверштаг, если это может вынудить другой буер изменить курс или скорость во избежание столкновения."]
[10,"Правило 6 В. Буер не должен делать поворот оверштаг, если это может ______________________________________________________","Буер не должен делать поворот фордевинд или оверштаг, если это может вынудить другой буер изменить курс или скорость во избежание столкновения."]
{"$rows_left_out":31}
{"sheet":"Управление","index":8,"n_rows":27,"n_cols":5,"rows_kept":27,"cut":false,"hidden":false,"merged":[]}
[1,"Курсы буера относительно ветра: “на ветер”, “по ветру”, левентик. ",null,1,"Что такое курс? Какие бывают курсы Буеров?"]
[2,"Работа парусами, галсом.",null,2,"Что такое галс? Какие бывают галсы?"]
[3," Разгон буера “на ветер”, “по ветру”, остановка и торможение буера. ",null,3,"Какие курсы называются «Полные курсы», а какие «Острые курсы»?"]
[4,"Приведение к ветру и уваливание. ",null,4,"Что такое поворот?"]
[5,"Особенности вождения буера: лёд-двойник, снежные пироги, трещины, торосы",null,5,"Что такое поворот оверштаг?"]
[6,"Особенности вождения буера: наличие на курсе буера людей, предметов на льду, тонкого льда, полыньи.",null,6,"Что такое поворот фордевинд?"]
[7,"Настройка парусов Буера",null,7,"Что такое увалиться?"]
[8,"Лавировка  на волне.  Работа парусов",null,8,"Что такое привестись?"]
[9,"Лавировка в сильный ветер. Работа парусов",null,9,"Что такое правый галс?"]
[10,"Острые курсы: бейдевинд крутой и полный; галфвинд. Полные курсы: бакштаг острый и полный, фордевинд. Положение левентик.",null,10,"10. Что такое левый галс?"]
{"$rows_left_out":18}
{"sheet":"Навигация","index":9,"n_rows":30,"n_cols":16,"rows_kept":30,"cut":false,"hidden":false,"merged":[]}
[1,"Курсы буера относительно ветра: “на ветер”, “по ветру”, левентик. "]
[2,"Работа парусами, галсом."]
[3," Разгон буера “на ветер”, “по ветру”, остановка и торможение буера. "]
[4,"Приведение к ветру и уваливание. "]
[5,"Особенности вождения буера: лёд-двойник, снежные пироги, трещины, торосы"]
[6,"Особенности вождения буера: наличие на курсе буера людей, предметов на льду, тонкого льда, полыньи."]
[7,"Проверка Буера перед выходом на соответствие правилам класса"]
[8,"Проверка Буера перед выходом на соответствие  закрепленного оборудования и снабжения."]
[9,"Помощь  находящимся в опасности"]
[10,"Районы плавания. Разрешенные акватории тренировок для вашей Буера"]
{"$rows_left_out":21}
{"sheet":"Практика","index":10,"n_rows":21,"n_cols":2,"rows_kept":21,"cut":false,"hidden":false,"merged":[]}
[1," Выход из гавани буера ."]
[2,"Подход  буера нва стоянку при различных курсах."]
[3,"Выполнение Поворотов оверштаг, фордевинд."]
[4,"Ваши действия Задний ход?"]
[5,"Ваши действия  в ситуации « ВАШ Буер опрокинулся»."]
[6," Выход из гавани буера ."]
[7,"Подход  буера на стоянку при различных курсах."]
[8," Выход из гавани буера ."]
[9,"Подход  буера нва стоянку при различных курсах."]
[10,"Выполнение Поворотов оверштаг, фордевинд."]
{"$rows_left_out":11}